{"text_format":"1","workbook":"xlsx","n_sheets":2,"sheets":["декабрь","НазвТЗ"],"not_rendered":{"charts":0,"images":0,"macros":1,"external_links":0,"defined_names":2,"comments":0,"pivot_tables":0},"unopened":[],"bounds":{"document_bytes":16777216,"sheet_cells":100000,"rows_first":2000,"rows_last":500,"rows_between":2000,"halvings":0,"cell_chars":16384,"cell_head_chars":4096},"cells_cut":0,"cells_raw":0,"read":"whole","date_system":"1900"}

{"sheet":"декабрь","index":0,"n_rows":2125,"n_cols":5,"rows_kept":2125,"cut":false,"hidden":false,"merged":[[28,0,29,5],[30,0,31,5],[32,0,33,5],[34,0,35,5],[36,0,37,5],[27,7,27,17],[36,7,36,8],[36,9,36,15],[37,7,37,8],[37,9,37,15],[34,7,34,8],[34,9,34,15],[28,7,28,8],[28,9,28,15],[29,7,29,8],[29,9,29,15],[35,7,35,8],[35,9,35,15],[32,7,32,8],[32,9,32,15],[33,7,33,8],[33,9,33,15],[39,6,39,8],[2,16,2,17],[0,2,0,3],[0,4,0,8],[0,10,0,14],[1,2,1,3],[1,4,1,8],[1,10,1,14],[2,3,3,3],[2,8,3,8],[2,12,3,12],[26,2,26,12],[30,7,30,8],[30,9,30,15],[31,7,31,8],[31,9,31,15]]}
["заказчик","номер ТЗ"]
[]
[null,null,null,null,"тираж"]
[null,8]
[{"$f":"VLOOKUP($B5,НазвТЗ!$A$2:$D$9,2,FALSE)","v":"Гуд Фуд"},5,{"$f":"VLOOKUP($B5,НазвТЗ!$A$2:$D$9,3,FALSE)","v":"Этикетка текстовая"},null,{"$f":"VLOOKUP($B5,НазвТЗ!$A$2:$D$9,4,FALSE)","v":20000}]
[{"$f":"VLOOKUP(B6,НазвТЗ!$A$2:$D$9,2,FALSE)","v":{"$error":"#N/A"}},null,{"$f":"VLOOKUP(B6,НазвТЗ!$A$2:$D$9,3,FALSE)","v":{"$error":"#N/A"}},null,{"$f":"VLOOKUP($B6,НазвТЗ!$A$2:$D$9,4,FALSE)","v":{"$error":"#N/A"}}]
[{"$f":"VLOOKUP(B7,НазвТЗ!$A$2:$D$9,2,FALSE)","v":{"$error":"#N/A"}},null,{"$f":"VLOOKUP(B7,НазвТЗ!$A$2:$D$9,3,FALSE)","v":{"$error":"#N/A"}},null,{"$f":"VLOOKUP($B7,НазвТЗ!$A$2:$D$9,4,FALSE)","v":{"$error":"#N/A"}}]
[{"$f":"VLOOKUP(B8,НазвТЗ!$A$2:$D$9,2,FALSE)","v":{"$error":"#N/A"}},null,{"$f":"VLOOKUP(B8,НазвТЗ!$A$2:$D$9,3,FALSE)","v":{"$error":"#N/A"}},null,{"$f":"VLOOKUP($B8,НазвТЗ!$A$2:$D$9,4,FALSE)","v":{"$error":"#N/A"}}]
[{"$f":"VLOOKUP(B9,НазвТЗ!$A$2:$D$9,2,FALSE)","v":{"$error":"#N/A"}},null,{"$f":"VLOOKUP(B9,НазвТЗ!$A$2:$D$9,3,FALSE)","v":{"$error":"#N/A"}},null,{"$f":"VLOOKUP($B9,НазвТЗ!$A$2:$D$9,4,FALSE)","v":{"$error":"#N/A"}}]
[{"$f":"VLOOKUP(B10,НазвТЗ!$A$2:$D$9,2,FALSE)","v":{"$error":"#N/A"}},null,{"$f":"VLOOKUP(B10,НазвТЗ!$A$2:$D$9,3,FALSE)","v":{"$error":"#N/A"}},null,{"$f":"VLOOKUP($B10,НазвТЗ!$A$2:$D$9,4,FALSE)","v":{"$error":"#N/A"}}]
[{"$f":"VLOOKUP(B11,НазвТЗ!$A$2:$D$9,2,FALSE)","v":{"$error":"#N/A"}},null,{"$f":"VLOOKUP(B11,НазвТЗ!$A$2:$D$9,3,FALSE)","v":{"$error":"#N/A"}},null,{"$f":"VLOOKUP($B11,НазвТЗ!$A$2:$D$9,4,FALSE)","v":{"$error":"#N/A"}}]
[{"$f":"VLOOKUP(B12,НазвТЗ!$A$2:$D$9,2,FALSE)","v":{"$error":"#N/A"}},null,{"$f":"VLOOKUP(B12,НазвТЗ!$A$2:$D$9,3,FALSE)","v":{"$error":"#N/A"}},null,{"$f":"VLOOKUP($B12,НазвТЗ!$A$2:$D$9,4,FALSE)","v":{"$error":"#N/A"}}]
[{"$f":"VLOOKUP(B13,НазвТЗ!$A$2:$D$9,2,FALSE)","v":{"$error":"#N/A"}},null,{"$f":"VLOOKUP(B13,НазвТЗ!$A$2:$D$9,3,FALSE)","v":{"$error":"#N/A"}},null,{"$f":"VLOOKUP($B13,НазвТЗ!$A$2:$D$9,4,FALSE)","v":{"$error":"#N/A"}}]
[{"$f":"VLOOKUP(B14,НазвТЗ!$A$2:$D$9,2,FALSE)","v":{"$error":"#N/A"}},null,{"$f":"VLOOKUP(B14,НазвТЗ!$A$2:$D$9,3,FALSE)","v":{"$error":"#N/A"}},null,{"$f":"VLOOKUP($B14,НазвТЗ!$A$2:$D$9,4,FALSE)","v":{"$error":"#N/A"}}]
[{"$f":"VLOOKUP(B15,НазвТЗ!$A$2:$D$9,2,FALSE)","v":{"$error":"#N/A"}}]
[{"$f":"VLOOKUP(B16,НазвТЗ!$A$2:$D$9,2,FALSE)","v":{"$error":"#N/A"}}]
[{"$f":"VLOOKUP(B17,НазвТЗ!$A$2:$D$9,2,FALSE)","v":{"$error":"#N/A"}}]
[{"$f":"VLOOKUP(B18,НазвТЗ!$A$2:$D$9,2,FALSE)","v":{"$error":"#N/A"}}]
[]
[]
[]
[]
[]
[]
[]
[]
[]
[]
[]
[]
[]
[]
[]
[]
[]
[]
[]
[]
[]
[]
[]
[]
[]
[]
[]
[]
[]
[]
[]
[]
[]
[]
[]
[]
[]
[]
[]
[]
[]
[]
[]
[]
[]
[]
[]
[]
[]
[]
[]
[]
[]
[]
[]
[]
[]
[]
[]
[]
[]
[]
[]
[]
[]
[]
[]
[]
[]
[]
[]
[]
[]
[]
[]
[]
[]
[]
[]
[]
[]
[]
[]
[]
[]
[]
[]
[]
[]
[]
[]
[]
[]
[]
[]
[]
[]
[]
[]
[]
[]
[]
[]
[]
[]
[]
[]
[]
[]
[]
[]
[]
[]
[]
[]
[]
[]
[]
[]
[]
[]
[]
[]
[]
[]
[]
[]
[]
[]
[]
[]
[]
[]
[]
[]
[]
[]
[]
[]
[]
[]
[]
[]
[]
[]
[]
[]
[]
[]
[]
[]
[]
[]
[]
[]
[]
[]
[]
[]
[]
[]
[]
[]
[]
[]
[]
[]
[]
[]
[]
[]
[]
[]
[]
[]
[]
[]
[]
[]
[]
[]
[]
[]
[]
[]
[]
[]
[]
[]
[]
[]
[]
[]
[]
[]
[]
[]
[]
[]
[]
[]
[]
[]
[]
[]
[]
[]
[]
[]
[]
[]
[]
[]
[]
[]
[]
[]
[]
[]
[]
[]
[]
[]
[]
[]
[]
[]
[]
[]
[]
[]
[]
[]
[]
[]
[]
[]
[]
[]
[]
[]
[]
[]
[]
[]
[]
[]
[]
[]
[]
[]
[]
[]
[]
[]
[]
[]
[]
[]
[]
[]
[]
[]
[]
[]
[]
[]
[]
[]
[]
[]
[]
[]
[]
[]
[]
[]
[]
[]
[]
[]
[]
[]
[]
[]
[]
[]
[]
[]
[]
[]
[]
[]
[]
[]
[]
[]
[]
[]
[]
[]
[]
[]
[]
[]
[]
[]
[]
[]
[]
[]
[]
[]
[]
[]
[]
[]
[]
[]
[]
[]
[]
[]
[]
[]
[]
[]
[]
[]
[]
[]
[]
[]
[]
[]
[]
[]
[]
[]
[]
[]
[]
[]
[]
[]
[]
[]
[]
[]
[]
[]
[]
[]
[]
[]
[]
[]
[]
[]
[]
[]
[]
[]
[]
[]
[]
[]
[]
[]
[]
[]
[]
[]
[]
[]
[]
[]
[]
[]
[]
[]
[]
{"$rows_left_out":1726}
{"sheet":"НазвТЗ","index":1,"n_rows":10,"n_cols":23,"rows_kept":10,"cut":false,"hidden":false,"merged":[]}
["тз","зак-к","этикетка","тираж","размер","размер","z","Кол-во ручьёв","Кол-во в ручье","втулка","номер намотки пр","номер намотки обр","кол-во этикеток в рулоне","макс. Диаметр","Длина, м","осталось сделать","Перемотчица","Дата перемотки","Тираж, шт","Кол-во метров","Перемотчица","Дата перемотки","Тираж, шт"]
[1,"М-Пластика","Салатник",30000]
[2,"М-Пластика","Брендовые IDEA (легкосъемный клей)",1000000]
[3,"Олива-Факел","СИГ",10000]
[4,"Олива-Факел","Этикетки на Термал TOP 58х60",100000]
[5,"Гуд Фуд","Этикетка текстовая",20000]
[6,"РуПринт","Размораживатель замков",30000]
[6,"РуПринт","Размораживатель замков с силиконом",30000]
[7,"Лидер","Бренд-скотч Swell",50300]
[{"$error":"#REF!"}]